{"text_format":"1","workbook":"xlsx","n_sheets":9,"sheets":["Cover Sheet","Budget Template","Salary","Effort Calculator","Subawards","Other","Indirect Cost Rates","Materials & Supplies","Travel"],"not_rendered":{"charts":0,"images":0,"macros":1,"external_links":0,"defined_names":3,"comments":1,"pivot_tables":0},"unopened":[],"bounds":{"document_bytes":16777216,"sheet_cells":100000,"rows_first":2000,"rows_last":500,"rows_between":2000,"halvings":0,"cell_chars":16384,"cell_head_chars":4096},"cells_cut":0,"cells_raw":0,"read":"whole","date_system":"1900"}

{"sheet":"Cover Sheet","index":0,"n_rows":22,"n_cols":12,"rows_kept":22,"cut":false,"hidden":false,"merged":[]}
["How many Years?",3]
["Summer Salary?","Yes"]
["Is Cost Share required?","No"]
["Equipment?","No",null,"Equipment means tangible personal property having a useful life of more than one year and a per-unit acquisition cost which is greater than or equal to $5,000.00."]
["Participant Support Costs?","No",null,"Participant Support Costs means direct costs for items such as stipends or subsistence allowances, travel allowances, and registration fees paid to or on behalf of participants or trainees (but not employees) in connection with conferences, or training projects."]
["Subawards?",1]
["How many Faculty?",1]
["How many Student?",1,null,"See the following link to locate the Categories of Employees policy for definitions:",null,null,null,null,null,null,null,"https://www.isu.edu/policy/human-resources/"]
{"$rows_left_out":15}
{"sheet":"Budget Template","index":1,"n_rows":229,"n_cols":108,"rows_kept":229,"cut":false,"hidden":false,"merged":[[0,0,0,1]]}
["Budget Template",null,"Yr 1 Requested (Academic)","Yr 1 Requested (Summer)",null,"Yr 1       Cost Share (Academic)","Yr 1       Cost Share (Summer)",null,"Yr 2 Requested (Academic)","Yr 2 Requested (Summer)",null,"Yr 2       Cost Share (Academic)","Yr 2       Cost Share (Summer)",null,"Yr 3 Requested (Academic)","Yr 3 Requested (Summer)",null,"Yr 3       Cost Share (Academic)","Yr 3       Cost Share (Summer)",null,"Yr 4 Requested (Academic)","Yr 4 Requested (Summer)",null,"Yr 4       Cost Share (Academic)","Yr 4       Cost Share (Summer)",null,"Yr 5 Requested (Academic)","Yr 5 Requested (Summer)",null,"Yr 5       Cost Share (Academic)","Yr 5       Cost Share (Summer)",null,"Yr 6 Requested (Academic)","Yr 6 Requested (Summer)",null,"Yr 6       Cost Share (Academic)","Yr 6       Cost Share (Summer)",null,"Total Requested","Total Requested (Summer)",null,"Total       Cost Share (Academic)","Total       Cost Share (Summer)",null,"Total Requested & Cost Share",null,null,"Yr 1 Requested    (Total)",null,"Yr 1       Cost Share    (Total)",null,"Yr 2 Requested    (Total)",null,"Yr 2       Cost Share    (Total)",null,"Yr 3 Requested    (Total)",null,"Yr 3       Cost Share    (Total)",null,"Yr 4 Requested    (Total)",null,"Yr 4       Cost Share    (Total)",null,"Yr 5 Requested    (Total)",null,"Total Requested",null,"Yr 6 Requested    (Total)",null,"Yr 6       Cost Share    (Total)",null,"Requested    (Total)",null,"Cost Share    (Total)",null,"Total Requested & Cost Share",null,null,null,"Yr 1 Requested    (Total)",null,"Yr 1       Cost Share    (Total)",null,"Yr 2 Requested    (Total)",null,"Yr 2       Cost Share    (Total)",null,"Yr 3 Requested    (Total)",null,"Yr 3       Cost Share    (Total)",null,"Yr 4 Requested    (Total)",null,"Yr 4        Cost Share    (Total)",null,"Yr 5 Requested    (Total)",null,"Yr 5       Cost Share    (Total)",null,"Yr 6 Requested    (Total)",null,"Yr 6       Cost Share    (Total)",null,"Requested    (Total of F/T and P/T)",null,"Cost Share    (Total of F/T and P/T)",null,"Total Requested & Cost Share"]
["Salaries- Enter Amounts in 'Salary' tab"]
[{"$f":"Salary!A3","v":"Facutly 1 - Assumed to be Full Time"},null,{"$f":"Salary!B3*Salary!C3","v":0},{"$f":"IF(Salary!E3=\"Yes\",Salary!G3,0)","v":0},null,{"$f":"Salary!I3*Salary!J3","v":0},{"$f":"IF(Salary!L3=\"Yes\",Salary!N3,0)","v":0},null,{"$f":"Salary!P3*Salary!Q3","v":0},{"$f":"IF(Salary!S3=\"Yes\",Salary!U3,0)","v":0},null,{"$f":"Salary!W3*Salary!X3","v":0},{"$f":"IF(Salary!Z3=\"Yes\",Salary!AB3,0)","v":0},null,{"$f":"Salary!AD3*Salary!AE3","v":0},{"$f":"IF(Salary!AG3=\"Yes\",Salary!AI3,0)","v":0},null,{"$f":"Salary!AK3*Salary!AL3","v":0},{"$f":"IF(Salary!AN3=\"Yes\",Salary!AP3,0)","v":0},null,{"$f":"Salary!AR3*Salary!AS3","v":0},{"$f":"IF(Salary!AU3=\"Yes\",Salary!AW3,0)","v":0},null,{"$f":"Salary!AY3*Salary!AZ3","v":0},{"$f":"IF(Salary!BB3=\"Yes\",Salary!BD3,0)","v":0},null,{"$f":"Salary!BF3*Salary!BG3","v":0},{"$f":"IF(Salary!BI3=\"Yes\",Salary!BK3,0)","v":0},null,{"$f":"Salary!BM3*Salary!BN3","v":0},{"$f":"IF(Salary!BP3=\"Yes\",Salary!BR3,0)","v":0},null,{"$f":"Salary!BT3*Salary!BU3","v":0},{"$f":"IF(Salary!BW3=\"Yes\",Salary!BY3,0)","v":0},null,{"$f":"Salary!CA3*Salary!CB3","v":0},{"$f":"IF(Salary!CD3=\"Yes\",Salary!CF3,0)","v":0},null,{"$f":"SumVisible(C3,I3,O3,U3,AA3,AG3)","v":0},{"$f":"SumVisible(D3,J3,P3,V3,AB3,AH3)","v":0},null,{"$f":"SumVisible(F3,L3,R3,X3,AD3,AJ3)","v":0},{"$f":"SumVisible(G3,M3,S3,Y3,AE3,AK3)","v":0},null,{"$f":"SumVisible(C3:AL3)","v":0},null,null,{"$f":"SumVisible(C3:D3)","v":0},null,{"$f":"SumVisible(F3:G3)","v":0},null,{"$f":"SumVisible(I3:J3)","v":0},null,{"$f":"SumVisible(L3:M3)","v":0},null,{"$f":"SumVisible(O3:P3)","v":0},null,{"$f":"SumVisible(R3:S3)","v":0},null,{"$f":"SumVisible(U3:V3)","v":0},null,{"$f":"SumVisible(X3:Y3)","v":0},null,{"$f":"SumVisible(AA3:AB3)","v":0},null,{"$f":"SumVisible(AD3:AE3)","v":0},null,{"$f":"SumVisible(AG3:AH3)","v":0},null,{"$f":"SumVisible(AJ3:AK3)","v":0},null,{"$f":"SumVisible(C3:D3,I3:J3,O3:P3,U3:V3,AA3:AB3,AG3:AH3)","v":0},null,{"$f":"SumVisible(F3:G3,L3:M3,R3:S3,X3:Y3,AD3:AE3,AJ3:AK3)","v":0},null,{"$f":"SumVisible(C3:AL3)","v":0}]
[{"$f":"Salary!A4","v":"Facutly 2 - Assumed to be Full Time"},null,{"$f":"Salary!B4*Salary!C4","v":0},{"$f":"IF(Salary!E4=\"Yes\",Salary!G4,0)","v":0},null,{"$f":"Salary!I4*Salary!J4","v":0},{"$f":"IF(Salary!L4=\"Yes\",Salary!N4,0)","v":0},null,{"$f":"Salary!P4*Salary!Q4","v":0},{"$f":"IF(Salary!S4=\"Yes\",Salary!U4,0)","v":0},null,{"$f":"Salary!W4*Salary!X4","v":0},{"$f":"IF(Salary!Z4=\"Yes\",Salary!AB4,0)","v":0},null,{"$f":"Salary!AD4*Salary!AE4","v":0},{"$f":"IF(Salary!AG4=\"Yes\",Salary!AI4,0)","v":0},null,{"$f":"Salary!AK4*Salary!AL4","v":0},{"$f":"IF(Salary!AN4=\"Yes\",Salary!AP4,0)","v":0},null,{"$f":"Salary!AR4*Salary!AS4","v":0},{"$f":"IF(Salary!AU4=\"Yes\",Salary!AW4,0)","v":0},null,{"$f":"Salary!AY4*Salary!AZ4","v":0},{"$f":"IF(Salary!BB4=\"Yes\",Salary!BD4,0)","v":0},null,{"$f":"Salary!BF4*Salary!BG4","v":0},{"$f":"IF(Salary!BI4=\"Yes\",Salary!BK4,0)","v":0},null,{"$f":"Salary!BM4*Salary!BN4","v":0},{"$f":"IF(Salary!BP4=\"Yes\",Salary!BR4,0)","v":0},null,{"$f":"Salary!BT4*Salary!BU4","v":0},{"$f":"IF(Salary!BW4=\"Yes\",Salary!BY4,0)","v":0},null,{"$f":"Salary!CA4*Salary!CB4","v":0},{"$f":"IF(Salary!CD4=\"Yes\",Salary!CF4,0)","v":0},null,{"$f":"SumVisible(C4,I4,O4,U4,AA4,AG4)","v":0},{"$f":"SumVisible(D4,J4,P4,V4,AB4,AH4)","v":0},null,{"$f":"SumVisible(F4,L4,R4,X4,AD4,AJ4)","v":0},{"$f":"SumVisible(G4,M4,S4,Y4,AE4,AK4)","v":0},null,{"$f":"SumVisible(C4:AL4)","v":0},null,null,{"$f":"SumVisible(C4:D4)","v":0},null,0,null,0,null,0,null,0,null,0,null,0,null,0,null,0,null,0,null,{"$f":"SumVisible(AG4:AH4)","v":0},null,{"$f":"SumVisible(AJ4:AK4)","v":0},null,{"$f":"SumVisible(C4:D4,I4:J4,O4:P4,U4:V4,AA4:AB4,AG4:AH4)","v":0},null,{"$f":"SumVisible(F4:G4,L4:M4,R4:S4,X4:Y4,AD4:AE4,AJ4:AK4)","v":0},null,{"$f":"SumVisible(C4:AL4)","v":0}]
[{"$f":"Salary!A5","v":"Facutly 3 - Assumed to be Full Time"},null,{"$f":"Salary!B5*Salary!C5","v":0},{"$f":"IF(Salary!E5=\"Yes\",Salary!G5,0)","v":0},null,{"$f":"Salary!I5*Salary!J5","v":0},{"$f":"IF(Salary!L5=\"Yes\",Salary!N5,0)","v":0},null,{"$f":"Salary!P5*Salary!Q5","v":0},{"$f":"IF(Salary!S5=\"Yes\",Salary!U5,0)","v":0},null,{"$f":"Salary!W5*Salary!X5","v":0},{"$f":"IF(Salary!Z5=\"Yes\",Salary!AB5,0)","v":0},null,{"$f":"Salary!AD5*Salary!AE5","v":0},{"$f":"IF(Salary!AG5=\"Yes\",Salary!AI5,0)","v":0},null,{"$f":"Salary!AK5*Salary!AL5","v":0},{"$f":"IF(Salary!AN5=\"Yes\",Salary!AP5,0)","v":0},null,{"$f":"Salary!AR5*Salary!AS5","v":0},{"$f":"IF(Salary!AU5=\"Yes\",Salary!AW5,0)","v":0},null,{"$f":"Salary!AY5*Salary!AZ5","v":0},{"$f":"IF(Salary!BB5=\"Yes\",Salary!BD5,0)","v":0},null,{"$f":"Salary!BF5*Salary!BG5","v":0},{"$f":"IF(Salary!BI5=\"Yes\",Salary!BK5,0)","v":0},null,{"$f":"Salary!BM5*Salary!BN5","v":0},{"$f":"IF(Salary!BP5=\"Yes\",Salary!BR5,0)","v":0},null,{"$f":"Salary!BT5*Salary!BU5","v":0},{"$f":"IF(Salary!BW5=\"Yes\",Salary!BY5,0)","v":0},null,{"$f":"Salary!CA5*Salary!CB5","v":0},{"$f":"IF(Salary!CD5=\"Yes\",Salary!CF5,0)","v":0},null,0,0,null,0,0,null,0,null,null,0,null,0,null,0,null,0,null,0,null,0,null,0,null,0,null,0,null,0,null,0,null,0,null,0,null,0,null,0]
[{"$f":"Salary!A6","v":"Facutly 4 - Assumed to be Full Time"},null,{"$f":"Salary!B6*Salary!C6","v":0},{"$f":"IF(Salary!E6=\"Yes\",Salary!G6,0)","v":0},null,{"$f":"Salary!I6*Salary!J6","v":0},{"$f":"IF(Salary!L6=\"Yes\",Salary!N6,0)","v":0},null,{"$f":"Salary!P6*Salary!Q6","v":0},{"$f":"IF(Salary!S6=\"Yes\",Salary!U6,0)","v":0},null,{"$f":"Salary!W6*Salary!X6","v":0},{"$f":"IF(Salary!Z6=\"Yes\",Salary!AB6,0)","v":0},null,{"$f":"Salary!AD6*Salary!AE6","v":0},{"$f":"IF(Salary!AG6=\"Yes\",Salary!AI6,0)","v":0},null,{"$f":"Salary!AK6*Salary!AL6","v":0},{"$f":"IF(Salary!AN6=\"Yes\",Salary!AP6,0)","v":0},null,{"$f":"Salary!AR6*Salary!AS6","v":0},{"$f":"IF(Salary!AU6=\"Yes\",Salary!AW6,0)","v":0},null,{"$f":"Salary!AY6*Salary!AZ6","v":0},{"$f":"IF(Salary!BB6=\"Yes\",Salary!BD6,0)","v":0},null,{"$f":"Salary!BF6*Salary!BG6","v":0},{"$f":"IF(Salary!BI6=\"Yes\",Salary!BK6,0)","v":0},null,{"$f":"Salary!BM6*Salary!BN6","v":0},{"$f":"IF(Salary!BP6=\"Yes\",Salary!BR6,0)","v":0},null,{"$f":"Salary!BT6*Salary!BU6","v":0},{"$f":"IF(Salary!BW6=\"Yes\",Salary!BY6,0)","v":0},null,{"$f":"Salary!CA6*Salary!CB6","v":0},{"$f":"IF(Salary!CD6=\"Yes\",Salary!CF6,0)","v":0},null,0,0,null,0,0,null,0,null,null,0,null,0,null,0,null,0,null,0,null,0,null,0,null,0,null,0,null,0,null,0,null,0,null,0,null,0,null,0]
[{"$f":"Salary!A7","v":"Facutly 5 - Assumed to be Full Time"},null,{"$f":"Salary!B7*Salary!C7","v":0},{"$f":"IF(Salary!E7=\"Yes\",Salary!G7,0)","v":0},null,{"$f":"Salary!I7*Salary!J7","v":0},{"$f":"IF(Salary!L7=\"Yes\",Salary!N7,0)","v":0},null,{"$f":"Salary!P7*Salary!Q7","v":0},{"$f":"IF(Salary!S7=\"Yes\",Salary!U7,0)","v":0},null,{"$f":"Salary!W7*Salary!X7","v":0},{"$f":"IF(Salary!Z7=\"Yes\",Salary!AB7,0)","v":0},null,{"$f":"Salary!AD7*Salary!AE7","v":0},{"$f":"IF(Salary!AG7=\"Yes\",Salary!AI7,0)","v":0},null,{"$f":"Salary!AK7*Salary!AL7","v":0},{"$f":"IF(Salary!AN7=\"Yes\",Salary!AP7,0)","v":0},null,{"$f":"Salary!AR7*Salary!AS7","v":0},{"$f":"IF(Salary!AU7=\"Yes\",Salary!AW7,0)","v":0},null,{"$f":"Salary!AY7*Salary!AZ7","v":0},{"$f":"IF(Salary!BB7=\"Yes\",Salary!BD7,0)","v":0},null,{"$f":"Salary!BF7*Salary!BG7","v":0},{"$f":"IF(Salary!BI7=\"Yes\",Salary!BK7,0)","v":0},null,{"$f":"Salary!BM7*Salary!BN7","v":0},{"$f":"IF(Salary!BP7=\"Yes\",Salary!BR7,0)","v":0},null,{"$f":"Salary!BT7*Salary!BU7","v":0},{"$f":"IF(Salary!BW7=\"Yes\",Salary!BY7,0)","v":0},null,{"$f":"Salary!CA7*Salary!CB7","v":0},{"$f":"IF(Salary!CD7=\"Yes\",Salary!CF7,0)","v":0},null,0,0,null,0,0,null,0,null,null,0,null,0,null,0,null,0,null,0,null,0,null,0,null,0,null,0,null,0,null,0,null,0,null,0,null,0,null,0]
[{"$f":"Salary!A8","v":"Facutly 6 - Assumed to be Full Time"},null,{"$f":"Salary!B8*Salary!C8","v":0},{"$f":"IF(Salary!E8=\"Yes\",Salary!G8,0)","v":0},null,{"$f":"Salary!I8*Salary!J8","v":0},{"$f":"IF(Salary!L8=\"Yes\",Salary!N8,0)","v":0},null,{"$f":"Salary!P8*Salary!Q8","v":0},{"$f":"IF(Salary!S8=\"Yes\",Salary!U8,0)","v":0},null,{"$f":"Salary!W8*Salary!X8","v":0},{"$f":"IF(Salary!Z8=\"Yes\",Salary!AB8,0)","v":0},null,{"$f":"Salary!AD8*Salary!AE8","v":0},{"$f":"IF(Salary!AG8=\"Yes\",Salary!AI8,0)","v":0},null,{"$f":"Salary!AK8*Salary!AL8","v":0},{"$f":"IF(Salary!AN8=\"Yes\",Salary!AP8,0)","v":0},null,{"$f":"Salary!AR8*Salary!AS8","v":0},{"$f":"IF(Salary!AU8=\"Yes\",Salary!AW8,0)","v":0},null,{"$f":"Salary!AY8*Salary!AZ8","v":0},{"$f":"IF(Salary!BB8=\"Yes\",Salary!BD8,0)","v":0},null,{"$f":"Salary!BF8*Salary!BG8","v":0},{"$f":"IF(Salary!BI8=\"Yes\",Salary!BK8,0)","v":0},null,{"$f":"Salary!BM8*Salary!BN8","v":0},{"$f":"IF(Salary!BP8=\"Yes\",Salary!BR8,0)","v":0},null,{"$f":"Salary!BT8*Salary!BU8","v":0},{"$f":"IF(Salary!BW8=\"Yes\",Salary!BY8,0)","v":0},null,{"$f":"Salary!CA8*Salary!CB8","v":0},{"$f":"IF(Salary!CD8=\"Yes\",Salary!CF8,0)","v":0},null,0,0,null,0,0,null,0,null,null,0,null,0,null,0,null,0,null,0,null,0,null,0,null,0,null,0,null,0,null,0,null,0,null,0,null,0,null,0]
{"$rows_left_out":222}
{"sheet":"Salary","index":2,"n_rows":58,"n_cols":96,"rows_kept":58,"cut":false,"hidden":false,"merged":[]}
[null,"Yr 1                                                                              Requested Funding",null,null,null,null,null,null,"Yr 1                                                                                        Cost Share",null,null,null,null,null,null,"Yr 2                                                                              Requested Funding",null,null,null,null,null,null,"Yr 2                                                                                        Cost Share",null,null,null,null,null,null,"Yr 3                                                                              Requested Funding",null,null,null,null,null,null,"Yr 3                                                                                        Cost Share",null,null,null,null,null,null,"Yr 4                                                                              Requested Funding",null,null,null,null,null,null,"Yr 4                                                                                        Cost Share",null,null,null,null,null,null,"Yr 5                                                                              Requested Funding",null,null,null,null,null,null,"Yr 5                                                                                        Cost Share",null,null,null,null,null,null,"Yr 6                                                                              Requested Funding",null,null,null,null,null,null,"Yr 6                                                                                        Cost Share"]
["Enter Name Below*","Base Salary","% of Effort","Term (9,10,11,12)","Summer Salary (Yes/No)","# of Summer Months Worked","Summer Salary",null,"Base Salary","% of Effort","Term (9,10,11,12)","Summer Salary (Yes/No)","# of Summer Months Worked","Summer Salary",null,"Base Salary","% of Effort","Term (9,10,11,12)","Summer Salary (Yes/No)","# of Summer Months Worked","Summer Salary",null,"Base Salary","% of Effort","Term (9,10,11,12)","Summer Salary (Yes/No)","# of Summer Months Worked","Summer Salary",null,"Base Salary","% of Effort","Term (9,10,11,12)","Summer Salary (Yes/No)","# of Summer Months Worked","Summer Salary",null,"Base Salary","% of Effort","Term (9,10,11,12)","Summer Salary (Yes/No)","# of Summer Months Worked","Summer Salary",null,"Base Salary","% of Effort","Term (9,10,11,12)","Summer Salary (Yes/No)","# of Summer Months Worked","Summer Salary",null,"Base Salary","% of Effort","Term (9,10,11,12)","Summer Salary (Yes/No)","# of Summer Months Worked","Summer Salary",null,"Base Salary","% of Effort","Term (9,10,11,12)","Summer Salary (Yes/No)","# of Summer Months Worked","Summer Salary",null,"Base Salary","% of Effort","Term (9,10,11,12)","Summer Salary (Yes/No)","# of Summer Months Worked","Summer Salary",null,"Base Salary","% of Effort","Term (9,10,11,12)","Summer Salary (Yes/No)","# of Summer Months Worked","Summer Salary",null,"Base Salary","% of Effort","Term (9,10,11,12)","Summer Salary (Yes/No)","# of Summer Months Worked","Summer Salary"]
["Facutly 1 - Assumed to be Full Time",null,null,null,"No",null,{"$f":"IF(F3<>\"\",ROUNDDOWN(B3/D3,2),0)*F3","v":0},null,null,null,null,"No",null,{"$f":"IF(M3<>\"\",ROUNDDOWN(I3/K3,2),0)*M3","v":0},null,{"$f":"B3*1.03","v":0},null,{"$f":"D3","v":0},"No",null,{"$f":"IF(T3<>\"\",ROUNDDOWN(P3/R3,2),0)*T3","v":0},null,{"$f":"I3*1.03","v":0},null,{"$f":"K3","v":0},"No",null,{"$f":"IF(AA3<>\"\",ROUNDDOWN(W3/Y3,2),0)*AA3","v":0},null,{"$f":"P3*1.03","v":0},null,{"$f":"R3","v":0},"No",null,{"$f":"IF(AH3<>\"\",ROUNDDOWN(AD3/AF3,2),0)*AH3","v":0},null,{"$f":"W3*1.03","v":0},null,{"$f":"Y3","v":0},"No",null,{"$f":"IF(AO3<>\"\",ROUNDDOWN(AK3/AM3,2),0)*AO3","v":0},null,{"$f":"AD3*1.03","v":0},null,{"$f":"AF3","v":0},"No",null,{"$f":"IF(AV3<>\"\",ROUNDDOWN(AR3/AT3,2),0)*AV3","v":0},null,{"$f":"AK3*1.03","v":0},null,{"$f":"AM3","v":0},"No",null,{"$f":"IF(BC3<>\"\",ROUNDDOWN(AY3/BA3,2),0)*BC3","v":0},null,{"$f":"AR3*1.03","v":0},null,{"$f":"AT3","v":0},"No",null,{"$f":"IF(BJ3<>\"\",ROUNDDOWN(BF3/BH3,2),0)*BJ3","v":0},null,{"$f":"AY3*1.03","v":0},null,{"$f":"BA3","v":0},"No",null,{"$f":"IF(BQ3<>\"\",ROUNDDOWN(BM3/BO3,2),0)*BQ3","v":0},null,{"$f":"BF3*1.03","v":0},null,{"$f":"BH3","v":0},"No",null,{"$f":"IF(BX3<>\"\",ROUNDDOWN(BT3/BV3,2),0)*BX3","v":0},null,{"$f":"BM3*1.03","v":0},null,{"$f":"BO3","v":0},"No",null,{"$f":"IF(CE3<>\"\",ROUNDDOWN(CA3/CC3,2),0)*CE3","v":0},null,null,null,null,null,null,null,null,null,null,null,"Yes"]
["Facutly 2 - Assumed to be Full Time",null,null,null,"No",null,0,null,null,null,null,"No",null,0,null,0,null,0,"No",null,0,null,0,null,0,"No",null,0,null,0,null,0,"No",null,0,null,0,null,0,"No",null,0,null,0,null,0,"No",null,0,null,0,null,0,"No",null,0,null,0,null,0,"No",null,0,null,0,null,0,"No",null,0,null,0,null,0,"No",null,{"$f":"IF(BX4<>\"\",ROUNDDOWN(BT4/BV4,2),0)*BX4","v":0},null,0,null,0,"No",null,{"$f":"IF(CE4<>\"\",ROUNDDOWN(CA4/CC4,2),0)*CE4","v":0},null,null,null,null,null,null,null,null,null,null,null,"No"]
["Facutly 3 - Assumed to be Full Time",null,null,null,"No",null,0,null,null,null,null,"No",null,0,null,0,null,0,"No",null,0,null,0,null,0,"No",null,0,null,0,null,0,"No",null,0,null,0,null,0,"No",null,0,null,0,null,0,"No",null,0,null,0,null,0,"No",null,0,null,0,null,0,"No",null,0,null,0,null,0,"No",null,0,null,0,null,0,"No",null,0,null,0,null,0,"No",null,0]
["Facutly 4 - Assumed to be Full Time",null,null,null,"No",null,0,null,null,null,null,"No",null,0,null,0,null,0,"No",null,0,null,0,null,0,"No",null,0,null,0,null,0,"No",null,0,null,0,null,0,"No",null,0,null,0,null,0,"No",null,0,null,0,null,0,"No",null,0,null,0,null,0,"No",null,0,null,0,null,0,"No",null,0,null,0,null,0,"No",null,0,null,0,null,0,"No",null,0]
["Facutly 5 - Assumed to be Full Time",null,null,null,"No",null,0,null,null,null,null,"No",null,0,null,0,null,0,"No",null,0,null,0,null,0,"No",null,0,null,0,null,0,"No",null,0,null,0,null,0,"No",null,0,null,0,null,0,"No",null,0,null,0,null,0,"No",null,0,null,0,null,0,"No",null,0,null,0,null,0,"No",null,0,null,0,null,0,"No",null,0,null,0,null,0,"No",null,0]
["Facutly 6 - Assumed to be Full Time",null,null,null,"No",null,0,null,null,null,null,"No",null,0,null,0,null,0,"No",null,0,null,0,null,0,"No",null,0,null,0,null,0,"No",null,0,null,0,null,0,"No",null,0,null,0,null,0,"No",null,0,null,0,null,0,"No",null,0,null,0,null,0,"No",null,0,null,0,null,0,"No",null,0,null,0,null,0,"No",null,0,null,0,null,0,"No",null,0]
{"$rows_left_out":51}
{"sheet":"Effort Calculator","index":3,"n_rows":69,"n_cols":24,"rows_kept":69,"cut":false,"hidden":false,"merged":[[39,1,39,2],[39,4,39,5],[39,7,39,8],[39,10,39,11],[41,4,41,5],[40,1,40,2],[40,4,40,5],[41,1,41,2],[40,7,40,8],[40,10,40,11],[41,7,41,8],[41,10,41,11],[0,1,0,5],[37,1,37,5],[2,19,2,20],[2,22,2,23],[2,1,2,2],[2,4,2,5],[3,19,3,20],[3,22,3,23],[3,1,3,2],[3,4,3,5],[4,19,4,20],[4,22,4,23],[4,1,4,2],[4,4,4,5],[4,16,4,17],[4,7,4,8],[4,10,4,11],[0,13,0,17],[2,13,2,14],[2,16,2,17],[3,13,3,14],[3,16,3,17],[4,13,4,14],[0,19,0,23],[0,7,0,11],[2,7,2,8],[2,10,2,11],[3,7,3,8],[3,10,3,11],[39,13,39,14],[39,16,39,17],[40,13,40,14],[40,16,40,17],[41,13,41,14],[41,16,41,17]]}
[null,"Convert Percent Effort to Academic Months",null,null,null,null,null,"Convert Percent Effort to 10 Months",null,null,null,null,null,"Convert Percent Effort to 11 Months",null,null,null,null,null,"Convert Percent Effort to Calendar Months"]
[]
[null,"Convert Percent Effort",null,null,"Convert Academic Months",null,null,"Convert Percent Effort",null,null,"Convert 10 Months",null,null,"Convert Percent Effort",null,null,"Convert 11 Months",null,null,"Convert Percent Effort",null,null,"Convert Calendar Months"]
[null,"to Academic Months",null,null,"to Percent Effort",null,null,"to 10 Months",null,null,"to Percent Effort",null,null,"to 11 Months",null,null,"to Percent Effort",null,null,"to Calendar Months",null,null,"to Percent Effort"]
[null,"(9-month appointment)",null,null,"(9-month appointment)",null,null,"(10-month appointment)",null,null,"(10-month appointment)",null,null,"(11-month appointment)",null,null,"(11-month appointment)",null,null,"(12-month appointment)",null,null,"(12-month appointment)"]
[null,"% Effort","Academic Months",null,"Academic Months","% Effort",null,"% Effort","10 Months",null,"10 Months","% Effort",null,"% Effort","11 Months",null,"11 Months","% Effort",null,"% Effort","Calendar Months",null,"Calendar Months","% Effort"]
[null,1,{"$f":"+B7*E$7","v":9},null,9,{"$f":"+E7/E$7","v":1},null,1,{"$f":"+H7*K$7","v":10},null,10,{"$f":"+K7/K$7","v":1},null,1,{"$f":"+N7*Q$7","v":11},null,11,{"$f":"+Q7/Q$7","v":1},null,1,{"$f":"+T7*W$7","v":12},null,12,{"$f":"+W7/W$7","v":1}]
[null,0.95,{"$f":"+B8*E$7","v":8.5499999999999989},null,8,{"$f":"+E8/E$7","v":0.88888888888888884},null,0.95,9.5,null,9,0.9,null,0.95,10.45,null,10,0.90909090909090906,null,0.95,11.399999999999999,null,11,0.91666666666666663]
{"$rows_left_out":62}
{"sheet":"Subawards","index":4,"n_rows":40,"n_cols":15,"rows_kept":40,"cut":false,"hidden":false,"merged":[]}
["Subawards",null,"Yr 1 Requested",null,"Yr 2 Requested",null,"Yr 3 Requested",null,"Yr 4 Requested",null,"Yr 5 Requested",null,"Yr 6 Requested",null,"Total Requested"]
[]
[null,"Subaward 1",null,null,null,null,null,null,null,null,null,null,null,null,{"$f":"SumVisible(C3:N3)","v":0}]
[null,"Subaward 2",null,null,null,null,null,null,null,null,null,null,null,null,{"$f":"SumVisible(C4:N4)","v":0}]
[null,"Subaward 3",null,null,null,null,null,null,null,null,null,null,null,null,{"$f":"SumVisible(C5:N5)","v":0}]
[null,"Subaward 4",null,null,null,null,null,null,null,null,null,null,null,null,{"$f":"SumVisible(C6:N6)","v":0}]
[null,"Subaward 5",null,null,null,null,null,null,null,null,null,null,null,null,0]
[null,"Subaward 6",null,null,null,null,null,null,null,null,null,null,null,null,0]
{"$rows_left_out":33}
{"sheet":"Other","index":5,"n_rows":22,"n_cols":31,"rows_kept":22,"cut":false,"hidden":false,"merged":[]}
["Other",null,"Yr 1 Requested",null,"Yr 1       Cost Share",null,"Yr 2 Requested",null,"Yr 2       Cost Share",null,"Yr 3 Requested",null,"Yr 3       Cost Share",null,"Yr 4 Requested",null,"Yr 4       Cost Share",null,"Yr 5 Requested",null,"Yr 5       Cost Share",null,"Yr 6 Requested",null,"Yr 6       Cost Share",null,"Total Requested",null,"Total       Cost Share",null,"Total Requested & Cost Share"]
[]
[null,"Overdraft",null,null,null,null,null,null,null,null,null,null,null,null,null,null,null,null,null,null,null,null,null,null,null,null,{"$f":"SumVisible(C3,G3,K3,O3,S3,W3)","v":0},null,{"$f":"SumVisible(E3,I3,M3,Q3,U3,Y3)","v":0},null,{"$f":"SumVisible(C3:Z3)","v":0}]
[null,"Enter Description Here",null,null,null,null,null,null,null,null,null,null,null,null,null,null,null,null,null,null,null,null,null,null,null,null,{"$f":"SumVisible(C4,G4,K4,O4,S4,W4)","v":0},null,{"$f":"SumVisible(E4,I4,M4,Q4,U4,Y4)","v":0},null,{"$f":"SumVisible(C4:Z4)","v":0}]
[null,"Enter Description Here",null,null,null,null,null,null,null,null,null,null,null,null,null,null,null,null,null,null,null,null,null,null,null,null,{"$f":"SumVisible(C5,G5,K5,O5,S5,W5)","v":0},null,0,null,0]
[null,"Enter Description Here",null,null,null,null,null,null,null,null,null,null,null,null,null,null,null,null,null,null,null,null,null,null,null,null,0,null,0,null,0]
[null,"Enter Description Here",null,null,null,null,null,null,null,null,null,null,null,null,null,null,null,null,null,null,null,null,null,null,null,null,0,null,0,null,0]
[null,"Enter Description Here",null,null,null,null,null,null,null,null,null,null,null,null,null,null,null,null,null,null,null,null,null,null,null,null,0,null,0,null,0]
{"$rows_left_out":15}
{"sheet":"Indirect Cost Rates","index":6,"n_rows":9,"n_cols":3,"rows_kept":9,"cut":false,"hidden":false,"merged":[]}
["Please select one from (drop down list)","ERROR"]
["44% of Modified Total Direct Costs",0.44]
["41% of Modified Total Direct Costs",0.41]
["34.5% of Modified Total Direct Costs",0.34499999999999997]
["26% of Modified Total Direct Costs",0.26]
["20% of Total Direct Costs",0.2]
["Other: Modified Total Direct Costs (go to 'Indirect Cost Rates' tab)",0.1]
["Other: Total Direct Costs (go to 'Indirect Cost Rates' tab)",0]
{"$rows_left_out":2}
{"sheet":"Materials & Supplies","index":7,"n_rows":0,"n_cols":0,"rows_kept":0,"cut":false,"hidden":false,"merged":[]}

{"sheet":"Travel","index":8,"n_rows":0,"n_cols":0,"rows_kept":0,"cut":false,"hidden":false,"merged":[]}